{"text_format":"1","workbook":"xlsx","n_sheets":11,"sheets":["Front Page","Project Table","Inventory Table 1","Inventory Table 2","Inventory Table 3","Back Page","Documentation Template","Compare","Comment Code Sheet","Survey Review Log","2011 data"],"not_rendered":{"charts":0,"images":0,"macros":1,"external_links":4,"defined_names":40,"comments":0,"pivot_tables":0},"unopened":[],"bounds":{"document_bytes":16777216,"sheet_cells":100000,"rows_first":2000,"rows_last":500,"rows_between":2000,"halvings":0,"cell_chars":16384,"cell_head_chars":4096},"cells_cut":0,"cells_raw":0,"read":"whole","date_system":"1900"}

{"sheet":"Front Page","index":0,"n_rows":26,"n_cols":11,"rows_kept":26,"cut":false,"hidden":false,"merged":[[8,2,8,3],[9,2,9,3],[0,1,0,8],[1,1,1,8],[3,1,3,10],[6,1,6,3],[6,4,6,5],[6,6,6,10],[18,1,19,1],[16,2,17,3],[13,4,13,5],[13,6,13,10],[7,1,7,3],[7,4,7,5],[7,6,7,10],[8,4,8,5],[8,6,8,10],[9,4,9,5],[9,6,9,10],[10,6,10,10],[11,4,11,5],[11,6,11,10],[12,4,12,5],[12,6,12,10],[14,6,14,10],[15,6,15,10],[16,4,16,6],[18,4,18,6],[15,2,15,3],[18,2,19,3],[20,1,20,10],[21,1,21,10],[22,1,22,10],[23,9,23,10],[25,1,25,10],[10,2,10,3],[11,2,11,3],[12,2,12,3],[13,2,13,3],[14,2,14,3]]}
[null,"2015 Drinking Water Infrastructure",null,null,null,null,null,null,null,null,"OMB Control No.: 2040-0274"]
[null,"Needs Survey And Assessment",null,null,null,null,null,null,null,null,"Approval Expires: 06/30/2018"]
[null,"*PWSID #*",null,null,"             U.S. Environmental Protection Agency",null,null,null,null,null,"Federal PWSID No.:"]
[null,"Washington, DC 20460"]
[]
[null,"Please verify or correct the following information:"]
[null,null,null,null,"Check if Correct",null,"Corrected Information"]
[null,null,null,null,"as Printed",null,"(Fill in only if preprinted information is missing or incorrect)"]
[null,"Name of System (Community): "]
[null,"Name of Contact: "]
[null,"Street Address: "]
[null,"City, State, and Zip: "]
[null,"Population Served (if wholesaler, include consecutive population as appropriate): "]
[null,"Number of Connections (not including consecutive systems): "]
[null,"Total System Design Capacity (in MGD):  "]
{"$rows_left_out":12}
{"sheet":"Project Table","index":1,"n_rows":502,"n_cols":52,"rows_kept":502,"cut":false,"hidden":false,"merged":[]}
[null,null,null,null,null,null,null,"Project Table",null,null,null,null,"Federal PWSID No.: "]
["Project Number","Project Name ","Type of Need ","Reason for Need","N,E,R,H\n(New\nExpand\nReplace\nReHab)","C or F\n(Current \nFuture)","Regula-\ntion","Design Capacity\n(MG, MGD, or kW)","Diameter\n(inches)","Length\n(feet) ","Number Needed ","Cost \nEstimate ","Cost Date\n(mm/yyyy) ","Documen-tation ","Remove Modify or Validate",null,"Comment Codes"]
["Ex. 1","Replace wells 5 and 8 at 0.5 MGD each","R1","A1","R","C","4A",0.5,null,null,2,null,null,"6, 10"]
["Ex. 2","Replace Deteriorated Transmission Main","X2","A1","R","C","4A",null,24,20000,null,4200000,"2015-06-01",1]
[null,null,null,null,null,null,null,null,null,null,null,null,null,null,null,null,null,null,null,null,null,null,null,null,null,null,null,null,null,null,null,null,null,null,null,null,null,null,null,null,null,null,null,null,null,null,null,null,null,null,null,"\n"]
[null,null,null,null,null,null,null,null,null,null,null,null,null,null,null,null,null,null,null,null,null,null,null,null,null,null,null,null,null,null,null,null,null,null,null,null,null,null,null,null,null,null,null,null,null,null,null,null,null,null,null,"\n"]
[null,null,null,null,null,null,null,null,null,null,null,null,null,null,null,null,null,null,null,null,null,null,null,null,null,null,null,null,null,null,null,null,null,null,null,null,null,null,null,null,null,null,null,null,null,null,null,null,null,null,null,"\n"]
[null,null,null,null,null,null,null,null,null,null,null,null,null,null,null,null,null,null,null,null,null,null,null,null,null,null,null,null,null,null,null,null,null,null,null,null,null,null,null,null,null,null,null,null,null,null,null,null,null,null,null,"\n"]
[null,null,null,null,null,null,null,null,null,null,null,null,null,null,null,null,null,null,null,null,null,null,null,null,null,null,null,null,null,null,null,null,null,null,null,null,null,null,null,null,null,null,null,null,null,null,null,null,null,null,null,"\n"]
[null,null,null,null,null,null,null,null,null,null,null,null,null,null,null,null,null,null,null,null,null,null,null,null,null,null,null,null,null,null,null,null,null,null,null,null,null,null,null,null,null,null,null,null,null,null,null,null,null,null,null,"\n"]
[null,null,null,null,null,null,null,null,null,null,null,null,null,null,null,null,null,null,null,null,null,null,null,null,null,null,null,null,null,null,null,null,null,null,null,null,null,null,null,null,null,null,null,null,null,null,null,null,null,null,null,"\n"]
[null,null,null,null,null,null,null,null,null,null,null,null,null,null,null,null,null,null,null,null,null,null,null,null,null,null,null,null,null,null,null,null,null,null,null,null,null,null,null,null,null,null,null,null,null,null,null,null,null,null,null,"\n"]
[null,null,null,null,null,null,null,null,null,null,null,null,null,null,null,null,null,null,null,null,null,null,null,null,null,null,null,null,null,null,null,null,null,null,null,null,null,null,null,null,null,null,null,null,null,null,null,null,null,null,null,"\n"]
[null,null,null,null,null,null,null,null,null,null,null,null,null,null,null,null,null,null,null,null,null,null,null,null,null,null,null,null,null,null,null,null,null,null,null,null,null,null,null,null,null,null,null,null,null,null,null,null,null,null,null,"\n"]
[null,null,null,null,null,null,null,null,null,null,null,null,null,null,null,null,null,null,null,null,null,null,null,null,null,null,null,null,null,null,null,null,null,null,null,null,null,null,null,null,null,null,null,null,null,null,null,null,null,null,null,"\n"]
{"$rows_left_out":488}
{"sheet":"Inventory Table 1","index":2,"n_rows":38,"n_cols":11,"rows_kept":38,"cut":false,"hidden":false,"merged":[[25,7,26,9],[36,1,38,3],[36,4,38,6],[36,7,38,9],[37,10,38,12],[31,1,31,12],[33,1,35,3],[33,4,35,6],[33,7,35,9],[33,10,35,12],[32,1,32,3],[32,4,32,6],[32,7,32,9],[32,10,32,12],[29,10,30,12],[27,1,28,3],[22,1,22,12],[23,1,23,3],[23,4,23,6],[23,7,23,9],[23,10,23,12],[27,4,28,6],[27,7,28,9],[29,1,30,3],[29,4,30,6],[29,7,30,9],[24,1,24,9],[24,10,26,12],[25,1,26,3],[25,4,26,6],[12,1,14,3],[12,4,14,6],[12,7,14,9],[12,10,14,12],[15,1,16,3],[15,4,16,6],[15,7,16,9],[16,10,17,12],[17,1,21,3],[17,4,19,6],[17,7,19,9],[20,4,21,6],[20,7,21,9],[0,0,0,12],[10,1,10,12],[11,1,11,3],[11,4,11,6],[11,7,11,9],[11,10,11,12]]}
["Source, Treatment, Storage, and Pumping Inventory"]
[]
[null,"To ensure all potential source, treatment, and storage projects are considered, it may be helpful to complete some or all of this inventory table. "]
[null,"However, completion of this table is not required."]
[null," ▪  Source Projects are all projects related to collecting and pumping raw water. This includes wells, surface water intakes, springs, off-stream raw  "]
[null,"    water storage, and pumps."]
[null," ▪  Treatment Projects are all projects related to disinfection, filtration, or other treatment processes for ground or surface water sources, or for "]
[null,"     treatment  applied in the distribution system."]
[null," ▪  Storage and Pumping Projects are related to finished or treated water storage, and booster pump stations."]
[]
[null,"Source Water"]
[null,"Inventory",null,null,"Needing Replacement",null,null,"Needing Rehabilitation",null,null,"New Infrastructure Needs"]
[null,"Total Number and Capacity of Existing Wells or Springs: ",null,null,"Wells (pumps included) or Springs:",null,null,"Wells (pumps included) or Springs: ",null,null,"Does your system have additional source water capacity needs to meet the needs of current users?"]
[]
[]
{"$rows_left_out":24}
{"sheet":"Inventory Table 2","index":3,"n_rows":28,"n_cols":15,"rows_kept":28,"cut":false,"hidden":false,"merged":[[18,2,19,2],[22,2,23,2],[26,2,27,2],[1,1,1,15],[4,1,4,9],[4,10,5,11],[5,1,5,9],[10,2,11,2],[14,2,15,2]]}
[null,"Transmission and Distribution Inventory"]
[null,"Transmission and distribution projects are the piping needs of a water system. Projects for valves, backflow prevention devices and assemblies, and meters that are not part of a transmission or distribution project listed in this table should be recorded in the table under the tab titled \"Inventory Table 3\"."]
[null,null,"On the table below, please provide an estimate of the total feet or miles of pipe in your system, if possible. Completion of this table is not required, but it may be helpful to"]
[null,null,"ensure all potential transmission and distribution pipe projects are considered."]
[null,"Note: The total feet or miles of pipe in your system is required information if any pipe projects are ",null,null,null,null,null,null,null,null,null,null,"     feet","Total Pipe"]
[null,"submitted based solely on survey-generated documentation (documentation codes 10 or 11).",null,null,null,null,null,null,null,null,null,null,"     miles","in System"]
[null,null,null,null,null,null,null,null,null,null,null,null,"(Check feet or miles)"]
[null,"Total Pipe in System"]
[null,null,null,"(Check feet or miles)",null,null,null,"<=6 inch",null,"8-12 inch",null,"15-42 inch",null,">=48 inch"]
[]
[null,null,"Plastic",null,"          feet \n          miles",null,"Amount of PVC by pipe size",null,"        feet \n       miles",null,"        feet \n       miles",null,"        feet \n       miles",null,"        feet \n       miles"]
[null,null,null,null,"% of total pipe",null,"% of this category/size pipe currently in poor condition or beyond useful life",null,"%",null,"%",null,"%",null,"%"]
[]
[]
[null,null,"Ductile\nIron",null,"          feet \n          miles",null,"Amount of ductile iron by pipe size",null,"        feet \n       miles",null,"        feet \n       miles",null,"        feet \n       miles",null,"        feet \n       miles"]
{"$rows_left_out":14}
{"sheet":"Inventory Table 3","index":4,"n_rows":16,"n_cols":9,"rows_kept":16,"cut":false,"hidden":false,"merged":[[5,2,5,11],[8,1,8,3],[8,4,8,6],[8,7,8,9]]}
[null,"Meters, Service Lines, Backflow Prevention Devices/Assemblies, Valves, etc."]
[null,null,"Projects for meters, service lines, backflow prevention devices and assemblies, valves, and other miscellaneous projects"]
[null,null,"are recorded in this section to accommodate entries of multiple identical items on one line in the project table. "]
[]
[null,null,"Record only projects that are not a part of another project (e.g., water main replacement projects will already include valves and other appurtenances). "]
[null,null,"EPA requires documentation of all projects provided. Applicable types of documentation are presented in List 4 of the Lists of Codes. \nUse only existing documentation of cost. We do not expect you to develop new cost estimates."]
[]
[null,"To ensure all potential projects are considered, it may be helpful to complete some or all of this inventory table.  However, completion of this table is not required."]
[null,"Inventory",null,null,"Needing Replacement",null,null,"New Infrastructure Needs"]
[null,null,"Total Number of Existing Water Meters:",null,null,"Number of Water Meters:\n",null,null,"Number of Water Meters:\n"]
[]
[null,null,"Total Number of Existing Backflow Prevention Devices/Assemblies:\n",null,null,"Number of Backflow Prevention Devices/Assemblies:\n",null,null,"Number of Backflow Prevention Devices/Assemblies:\n"]
[]
[null,null,"Total Number of Valves:",null,null,"Number of Valves:",null,null,"Number of Valves:"]
[]
{"$rows_left_out":2}
{"sheet":"Back Page","index":5,"n_rows":22,"n_cols":6,"rows_kept":22,"cut":false,"hidden":false,"merged":[[12,1,12,2],[1,1,1,6],[2,1,2,6],[3,1,3,6],[4,1,4,6],[5,1,5,6],[6,1,6,2],[7,1,7,2],[8,1,8,2],[9,1,9,2],[10,1,10,2],[11,1,11,2],[23,1,23,6],[16,1,16,6],[17,1,17,6],[18,1,18,6],[19,2,19,6],[20,1,20,6],[21,2,22,6]]}
[null,"Respondent Information"]
[]
[null,"Please provide the following information in case we need to contact you for clarification or additional explanation of any of your responses."]
[]
[null,"Contact Person (Person who completed this questionnaire):"]
[]
[null,"Signature:",null,null,null,"Telephone Number:"]
[null,"Name (please print): ",null,null,null,"Fax Number:"]
[null,"Title:",null,null,null,"E-mail Address:"]
[null,"Mailing Address:",null,null,null,"Best Time to Reach You:"]
[null,"(Street Address)"]
[]
[]
[]
[null,"If you have any questions, contact your state coordinator."]
{"$rows_left_out":8}
{"sheet":"Documentation Template","index":6,"n_rows":499,"n_cols":8,"rows_kept":499,"cut":false,"hidden":false,"merged":[]}
[null,null,null,"Summary of Survey-Generated and Independent Documentation for Each Project","Federal PWSID No.: "]
["Project Number","Project Name ","Documen-tation Code(s)","State/System Survey-Generated Statement","Independent Document Name","Independent Documentation Page Number(s)"]
[{"$f":"IF(LEN(INDEX('Project Table'!A:N,ROW()+2,1))=0,\"\",INDEX('Project Table'!A:N,ROW()+2,1))","v":""},{"$f":"IF(LEN(INDEX('Project Table'!A:N,ROW()+2,2))=0,\"\",INDEX('Project Table'!A:N,ROW()+2,2))","v":""},{"$f":"IF(LEN(INDEX('Project Table'!A:N,ROW()+2,14))=0,\"\",INDEX('Project Table'!A:N,ROW()+2,14))","v":""},null,null,null,null,"\n"]
[{"$f":"IF(LEN(INDEX('Project Table'!A:N,ROW()+2,1))=0,\"\",INDEX('Project Table'!A:N,ROW()+2,1))","v":""},{"$f":"IF(LEN(INDEX('Project Table'!A:N,ROW()+2,2))=0,\"\",INDEX('Project Table'!A:N,ROW()+2,2))","v":""},{"$f":"IF(LEN(INDEX('Project Table'!A:N,ROW()+2,14))=0,\"\",INDEX('Project Table'!A:N,ROW()+2,14))","v":""},null,null,null,null,"\n"]
[{"$f":"IF(LEN(INDEX('Project Table'!A:N,ROW()+2,1))=0,\"\",INDEX('Project Table'!A:N,ROW()+2,1))","v":""},{"$f":"IF(LEN(INDEX('Project Table'!A:N,ROW()+2,2))=0,\"\",INDEX('Project Table'!A:N,ROW()+2,2))","v":""},{"$f":"IF(LEN(INDEX('Project Table'!A:N,ROW()+2,14))=0,\"\",INDEX('Project Table'!A:N,ROW()+2,14))","v":""},null,null,null,null,"\n"]
[{"$f":"IF(LEN(INDEX('Project Table'!A:N,ROW()+2,1))=0,\"\",INDEX('Project Table'!A:N,ROW()+2,1))","v":""},{"$f":"IF(LEN(INDEX('Project Table'!A:N,ROW()+2,2))=0,\"\",INDEX('Project Table'!A:N,ROW()+2,2))","v":""},{"$f":"IF(LEN(INDEX('Project Table'!A:N,ROW()+2,14))=0,\"\",INDEX('Project Table'!A:N,ROW()+2,14))","v":""},null,null,null,null,"\n"]
[{"$f":"IF(LEN(INDEX('Project Table'!A:N,ROW()+2,1))=0,\"\",INDEX('Project Table'!A:N,ROW()+2,1))","v":""},{"$f":"IF(LEN(INDEX('Project Table'!A:N,ROW()+2,2))=0,\"\",INDEX('Project Table'!A:N,ROW()+2,2))","v":""},{"$f":"IF(LEN(INDEX('Project Table'!A:N,ROW()+2,14))=0,\"\",INDEX('Project Table'!A:N,ROW()+2,14))","v":""},null,null,null,null,"\n"]
[{"$f":"IF(LEN(INDEX('Project Table'!A:N,ROW()+2,1))=0,\"\",INDEX('Project Table'!A:N,ROW()+2,1))","v":""},{"$f":"IF(LEN(INDEX('Project Table'!A:N,ROW()+2,2))=0,\"\",INDEX('Project Table'!A:N,ROW()+2,2))","v":""},{"$f":"IF(LEN(INDEX('Project Table'!A:N,ROW()+2,14))=0,\"\",INDEX('Project Table'!A:N,ROW()+2,14))","v":""},null,null,null,null,"\n"]
[{"$f":"IF(LEN(INDEX('Project Table'!A:N,ROW()+2,1))=0,\"\",INDEX('Project Table'!A:N,ROW()+2,1))","v":""},{"$f":"IF(LEN(INDEX('Project Table'!A:N,ROW()+2,2))=0,\"\",INDEX('Project Table'!A:N,ROW()+2,2))","v":""},{"$f":"IF(LEN(INDEX('Project Table'!A:N,ROW()+2,14))=0,\"\",INDEX('Project Table'!A:N,ROW()+2,14))","v":""},null,null,null,null,"\n"]
[{"$f":"IF(LEN(INDEX('Project Table'!A:N,ROW()+2,1))=0,\"\",INDEX('Project Table'!A:N,ROW()+2,1))","v":""},{"$f":"IF(LEN(INDEX('Project Table'!A:N,ROW()+2,2))=0,\"\",INDEX('Project Table'!A:N,ROW()+2,2))","v":""},{"$f":"IF(LEN(INDEX('Project Table'!A:N,ROW()+2,14))=0,\"\",INDEX('Project Table'!A:N,ROW()+2,14))","v":""},null,null,null,null,"\n"]
[{"$f":"IF(LEN(INDEX('Project Table'!A:N,ROW()+2,1))=0,\"\",INDEX('Project Table'!A:N,ROW()+2,1))","v":""},{"$f":"IF(LEN(INDEX('Project Table'!A:N,ROW()+2,2))=0,\"\",INDEX('Project Table'!A:N,ROW()+2,2))","v":""},{"$f":"IF(LEN(INDEX('Project Table'!A:N,ROW()+2,14))=0,\"\",INDEX('Project Table'!A:N,ROW()+2,14))","v":""},null,null,null,null,"\n"]
[{"$f":"IF(LEN(INDEX('Project Table'!A:N,ROW()+2,1))=0,\"\",INDEX('Project Table'!A:N,ROW()+2,1))","v":""},{"$f":"IF(LEN(INDEX('Project Table'!A:N,ROW()+2,2))=0,\"\",INDEX('Project Table'!A:N,ROW()+2,2))","v":""},{"$f":"IF(LEN(INDEX('Project Table'!A:N,ROW()+2,14))=0,\"\",INDEX('Project Table'!A:N,ROW()+2,14))","v":""},null,null,null,null,"\n"]
[{"$f":"IF(LEN(INDEX('Project Table'!A:N,ROW()+2,1))=0,\"\",INDEX('Project Table'!A:N,ROW()+2,1))","v":""},{"$f":"IF(LEN(INDEX('Project Table'!A:N,ROW()+2,2))=0,\"\",INDEX('Project Table'!A:N,ROW()+2,2))","v":""},{"$f":"IF(LEN(INDEX('Project Table'!A:N,ROW()+2,14))=0,\"\",INDEX('Project Table'!A:N,ROW()+2,14))","v":""},null,null,null,null,"\n"]
[{"$f":"IF(LEN(INDEX('Project Table'!A:N,ROW()+2,1))=0,\"\",INDEX('Project Table'!A:N,ROW()+2,1))","v":""},{"$f":"IF(LEN(INDEX('Project Table'!A:N,ROW()+2,2))=0,\"\",INDEX('Project Table'!A:N,ROW()+2,2))","v":""},{"$f":"IF(LEN(INDEX('Project Table'!A:N,ROW()+2,14))=0,\"\",INDEX('Project Table'!A:N,ROW()+2,14))","v":""},null,null,null,null,"\n"]
[{"$f":"IF(LEN(INDEX('Project Table'!A:N,ROW()+2,1))=0,\"\",INDEX('Project Table'!A:N,ROW()+2,1))","v":""},{"$f":"IF(LEN(INDEX('Project Table'!A:N,ROW()+2,2))=0,\"\",INDEX('Project Table'!A:N,ROW()+2,2))","v":""},{"$f":"IF(LEN(INDEX('Project Table'!A:N,ROW()+2,14))=0,\"\",INDEX('Project Table'!A:N,ROW()+2,14))","v":""},null,null,null,null,"\n"]
{"$rows_left_out":485}
{"sheet":"Compare","index":7,"n_rows":2,"n_cols":15,"rows_kept":2,"cut":false,"hidden":false,"merged":[]}
[null,null,null,null,null,null,null,"Project Table (Compare 2011 to 2015)",null,null,null,null,"Federal PWSID No.: "]
["Project Number","Project Name ","Type of Need ","Reason for Need","N,E,R,H\n(New\nExpand\nReplace\nReHab)","C or F\n(Current \nFuture)","Regula-\ntion","Design Capacity\n(MG, MGD, or kW)","Diameter\n(inches)","Length\n(feet) ","Number Needed ","Cost \nEstimate ","Cost Date\n(mm/yyyy) ","Documen-tation ","Remove Modify or Validate"]

{"sheet":"Comment Code Sheet","index":8,"n_rows":200,"n_cols":6,"rows_kept":200,"cut":false,"hidden":true,"merged":[]}
[null,"2015 Drinking Water Infrastructure Needs Survey and Assessment"]
[null,"Comment Code Sheet"]
[null,null,null,"Data Entry -- Do not record data in cross-hatched cells"]
[null,"PWSID:",{"$f":"IF(LEN(Compare!N1)=0,\"\",Compare!N1)","v":""}]
[null,"System Name:",{"$f":"IF(LEN('Front Page'!C9)=0,\"\",'Front Page'!C9)","v":""},"Total Pipe in System (ft):"]
[null,"Batch Number:",null,"Total R/H:",{"$f":"SUM(E10:E1048576)","v":0},{"$f":"SUM(F10:F1048576)","v":0}]
[null,"Water System \nStatus Code:",null,"Percentage R/H:",{"$f":"IFERROR(E6/E5,\"\")","v":""},{"$f":"IFERROR(F6/E5,\"\")","v":""}]
[]
["PWSID","Project Number","State Comment Code(s)","Internal Code(s)","Pipe R/H Length (in ft.)\nOriginal","Pipe R/H Length (in ft.)\nAmended"]
[{"$f":"$C$4","v":""}]
["",{"$f":"IF(B10=\"\",\"\",B10+1)","v":""}]
["",{"$f":"IF(B11=\"\",\"\",B11+1)","v":""}]
["",""]
["",""]
["",""]
{"$rows_left_out":186}
{"sheet":"Survey Review Log","index":9,"n_rows":100,"n_cols":3,"rows_kept":100,"cut":false,"hidden":true,"merged":[[0,1,0,2],[1,1,1,2]]}
[null,"2015 DRINKING WATER INFRASTRUCTURE NEEDS SURVEY AND ASSESSMENT"]
[null,"SURVEY REVIEW LOG"]
[null,"Additional costs for modeling? (Y/N)"]
[null,"PWSID:",{"$f":"IF('Comment Code Sheet'!C4=\"\",\"\",'Comment Code Sheet'!C4)","v":""}]
[null,"System Name:",{"$f":"IF('Comment Code Sheet'!C5=\"\",\"\",'Comment Code Sheet'!C5)","v":""}]
[null,"Cadmus Analyst:"]
[null,"Cadmus QA Reviewer:"]
[]
["PWSID","Project Number","Comments"]
[{"$f":"'Comment Code Sheet'!$A$10","v":""}]
[{"$f":"'Comment Code Sheet'!$A$10","v":""}]
[{"$f":"'Comment Code Sheet'!$A$10","v":""}]
[{"$f":"'Comment Code Sheet'!$A$10","v":""}]
[{"$f":"'Comment Code Sheet'!$A$10","v":""}]
[{"$f":"'Comment Code Sheet'!$A$10","v":""}]
{"$rows_left_out":86}
{"sheet":"2011 data","index":10,"n_rows":500,"n_cols":52,"rows_kept":500,"cut":false,"hidden":true,"merged":[]}
[null,null,null,null,null,null,null,"Project Table",null,null,null,null,"Federal PWSID No.: "]
["Project Number","Project Name ","Type of Need ","Reason for Need","N,E,R,H\n(New\nExpand\nReplace\nReHab)","C or F\n(Current \nFuture)","Regula-\ntion","Design Capacity\n(MG, MGD, or kW)","Diameter\n(inches)","Length\n(feet) ","Number Needed ","Cost \nEstimate ","Cost Date\n(mm/yyyy) ","Documen-tation ","Remove Modify or Validate",null,"Comment Codes",null,null,null,null,null,"2011 ProjectKey"]
[null,null,null,null,null,null,null,null,null,null,null,null,null,null,null,null,null,null,null,null,null,null,null,null,null,null,null,null,null,null,null,null,null,null,null,null,null,null,null,null,null,null,null,null,null,null,null,null,null,null,null,"\n"]
[null,null,null,null,null,null,null,null,null,null,null,null,null,null,null,null,null,null,null,null,null,null,null,null,null,null,null,null,null,null,null,null,null,null,null,null,null,null,null,null,null,null,null,null,null,null,null,null,null,null,null,"\n"]
[null,null,null,null,null,null,null,null,null,null,null,null,null,null,null,null,null,null,null,null,null,null,null,null,null,null,null,null,null,null,null,null,null,null,null,null,null,null,null,null,null,null,null,null,null,null,null,null,null,null,null,"\n"]
[null,null,null,null,null,null,null,null,null,null,null,null,null,null,null,null,null,null,null,null,null,null,null,null,null,null,null,null,null,null,null,null,null,null,null,null,null,null,null,null,null,null,null,null,null,null,null,null,null,null,null,"\n"]
[null,null,null,null,null,null,null,null,null,null,null,null,null,null,null,null,null,null,null,null,null,null,null,null,null,null,null,null,null,null,null,null,null,null,null,null,null,null,null,null,null,null,null,null,null,null,null,null,null,null,null,"\n"]
[null,null,null,null,null,null,null,null,null,null,null,null,null,null,null,null,null,null,null,null,null,null,null,null,null,null,null,null,null,null,null,null,null,null,null,null,null,null,null,null,null,null,null,null,null,null,null,null,null,null,null,"\n"]
[null,null,null,null,null,null,null,null,null,null,null,null,null,null,null,null,null,null,null,null,null,null,null,null,null,null,null,null,null,null,null,null,null,null,null,null,null,null,null,null,null,null,null,null,null,null,null,null,null,null,null,"\n"]
[null,null,null,null,null,null,null,null,null,null,null,null,null,null,null,null,null,null,null,null,null,null,null,null,null,null,null,null,null,null,null,null,null,null,null,null,null,null,null,null,null,null,null,null,null,null,null,null,null,null,null,"\n"]
[null,null,null,null,null,null,null,null,null,null,null,null,null,null,null,null,null,null,null,null,null,null,null,null,null,null,null,null,null,null,null,null,null,null,null,null,null,null,null,null,null,null,null,null,null,null,null,null,null,null,null,"\n"]
[null,null,null,null,null,null,null,null,null,null,null,null,null,null,null,null,null,null,null,null,null,null,null,null,null,null,null,null,null,null,null,null,null,null,null,null,null,null,null,null,null,null,null,null,null,null,null,null,null,null,null,"\n"]
[null,null,null,null,null,null,null,null,null,null,null,null,null,null,null,null,null,null,null,null,null,null,null,null,null,null,null,null,null,null,null,null,null,null,null,null,null,null,null,null,null,null,null,null,null,null,null,null,null,null,null,"\n"]
[null,null,null,null,null,null,null,null,null,null,null,null,null,null,null,null,null,null,null,null,null,null,null,null,null,null,null,null,null,null,null,null,null,null,null,null,null,null,null,null,null,null,null,null,null,null,null,null,null,null,null,"\n"]
[null,null,null,null,null,null,null,null,null,null,null,null,null,null,null,null,null,null,null,null,null,null,null,null,null,null,null,null,null,null,null,null,null,null,null,null,null,null,null,null,null,null,null,null,null,null,null,null,null,null,null,"\n"]
{"$rows_left_out":485}